{"text_format":"1","workbook":"xlsx","n_sheets":2,"sheets":["DATOS","1A"],"not_rendered":{"charts":0,"images":2,"macros":1,"external_links":0,"defined_names":58,"comments":0,"pivot_tables":0},"unopened":[],"bounds":{"document_bytes":16777216,"sheet_cells":100000,"rows_first":2000,"rows_last":500,"rows_between":2000,"halvings":0,"cell_chars":16384,"cell_head_chars":4096},"cells_cut":0,"cells_raw":0,"read":"whole","date_system":"1900"}

{"sheet":"DATOS","index":0,"n_rows":173,"n_cols":43,"rows_kept":173,"cut":false,"hidden":true,"merged":[]}
["ESCUELA","PERIODO","SEMESTRE","GRUPO","DIRECTOR",null,"I","CLAVE","HORAS POR SEMANA",null,"COLEGIO DEL GOLFO","PERIODO DE INICIO",null,"INSTITUTO GARDNER MÉXICO AMERICANO","PERIODO DE INICIO",null,"IBEROAMÉRICA","PERIODO DE INICIO",null,"NUEVA GENERACIÓN","PERIODO DE INICIO",null,"LICEO JUÁREZ","PERIODO DE INICIO",null,"COLEGIO HISPANO AMERICANO MARIA CURIE SC","PERIODO DE INICIO",null,"BENITO JUAREZ","PERIODO DE INICIO",null,"JOSÉ VASCONCELOS TURNO MATUTINO","PERIODO DE INICIO",null,"JOSÉ VASCONCELOS","PERIODO DE INICIO",null,"COLEGIO DEL CARIBE CARMEN","PERIODO DE INICIO","DIA","MES","AÑO","HORA"]
["INSTITUTO_GARDNER_MEXICO_AMERICANO","AGO2025","I","A","MAYRA DANIELA PORTILLA VIGUERAS",1,"CIENCIAS SOCIALES I (INTRODUCCION A LAS CIENCIAS SOCIALES)","102CSO1I",2,1,"ALEJANDRA CARAVEO OCHOA","AGO2021",1,"ALEJANDRA JAMILETT VALLADARES GOMEZ","AGO2019",1,"AMY MARTINA FERNANDA CARDENAS GOMEZ","FEB2019",1,"ALEJANDRA CHABLE CORONA","FEB2019",1,"ADRIANA BEATRIZ DEL RIO DE LA CRUZ","FEB2020",1,"AFRICA VANESSA RODRIGUEZ JIMENEZ","FEB2020",1,"ALEJANDRA BUSTOS VADILLO","FEB2021",1,"ALEJANDRA BERENICE JAUREGUI GÜEMES","FEB2023",1,"ALEJANDRA BERENICE JAUREGUI GÜEMES","FEB2023",1,"CARLOS DANIEL OCAÑA DAMIAN","AGO2025","DIA","MES","AÑO","07:00:00"]
["IBEROAMERICA","1 PREINTER ENE26","II","B","JOSÉ LUIS FLORES LUISJUAN",2,"CULTURA DIGITAL (INFORMATICA I)","102CDI2I",3,2,"ANALLELY TOLEDO GUTIERREZ","FEB2023",2,"ANA OLIVIA MEDINA SOLIS","FEB2021",2,"ANEL ZAPO CRUZ","FEB2020",2,"ALEJANDRO PEREZ FALCONI","AGO2018",2,"ANARELYS GARRIGA SOSA","FEB2016",2,"ALEJANDRA MONTERO BELTRAN","AGO2018",2,"ALEXANDER BARROSO DIAZ","AGO2010",2,"ALEJANDRO MORALES DIONICIO","FEB2024",2,"CARLA NATALIA DIONICIO SOLANO","AGO2023",2,"DANIEL ALBERTO MONTORES DE LA CRUZ","FEB2025",1,"ENERO",2025,"07:10:00"]
["NUEVA_GENERACION","2 PREINTER ENE26","III","C","MARGARITA PÉREZ ALDANA",3,"HUMANIDADES I (CONCIENCIA HUMANA I)","102HUM1I",4,3,"BERNAL IVAN MORALES HERRERA","AGO2023",3,"CARLOS ALFONSO SOLANA NERI","AGO2019",3,"ANGELES CANSECO CERVERA","FEB2020",3,"ANGELICA ROSARIO CARRILLO VALENCIA","AGO2017",3,"ARMANDO GUILLEMOS GARCIA ORTIZ","AGO2013",3,"ALICIA DEL CARMEN NOH DZIB","AGO2015",3,"ALFONSO ALBERTO CHAN RODRIGUEZ","AGO2008",3,"CARLA NATALIA DIONICIO SOLANA","AGO2023",3,"CARLOS GILBERTO JIMENEZ POOT","AGO2014",3,"DANIELA RUTH EUGENIA ARROYO CARRION","AGO2024",2,"FEBRERO",2026,"07:20:00"]
["LICEO_JUAREZ","FEB2026","IV","EXTRACURRICULAR (TALLERES)","FABIOLA DEL JESÚS CRUZ GUTIÉRREZ",4,"INGLES I","102ING5I",3,4,"BLANCA GUADALUPE SOSA AVILA","AGO2025",4,"CARLOS ENRIQUE RECIO URDANETA","SEP2020",4,"ANGELICA MARIA LOPEZ NOTARIO","FEB2019",4,"ANTONIO DEL JESUS GOMEZ PEREZ","FEB2025",4,"CARLOS ADRIAN MORENO TOLENTINO","AGO2014",4,"ANABELL MONTANO ARAGON","AGO2015",4,"ANA LAURA RICARDEZ FONZ","AGO2008",4,"CARLOS GILBERTO JIMENEZ POOT","AGO2023",4,"CARMINIA RAMAYO JIMENEZ","AGO2023",4,"DULCE CORAZON DE MARIA COBOS NOJ","AGO2025",3,"MARZO",2027,"07:30:00"]
["COLEGIO_HISPANO_AMERICANO_MARIA_CURIE_SC","1 PREINTER JUN26","V","PROPEDEUTICO (OPTATIVAS)","CARLOS ANTONIO SÁNCHEZ NAAL",5,"LA MATERIA Y SUS INTERACCIONES (QUIMICA I)","102QUI5I",4,5,"CARLOS ENRIQUE RECIO URDANETA","SEP2020",5,"CARMEN AIDA ESCOBEDO PEREZ","SEP2020",5,"ARESLI MOSQUEDA MARTINEZ","AGO2013",5,"CARLOS ALONSO CARRILLO SANGUINO","FEB2023",5,"CARLOS ALONSO CARRILLO SANGUINO","AGO2017",5,"BEATRIZ ADRIANA GASPAR SOBERANES","AGO2018",5,"ANA PATRICIA CORTES PEREZ","FEB2024",5,"CARMINIA RAMAYO JIMENEZ","AGO2023",5,"DANIELA PATRICIA BOJORQUEZ BELTRAN","AGO2024",5,"FERNANDO ALEJANDRO TUZ CHIN","AGO2025",4,"ABRIL",2028,"07:40:00"]
["BENITO_JUAREZ","2 PREINTER JUL26","VI","CAPACITACION (CAPACITACIONES)","MARISOL ORTEGA ZAVALA",6,"LENGUA Y COMUNICACIÓN I (LECTURA Y REDACCION)","102LYC1I",3,6,"CAROLINA GUTIERREZ GUTIERREZ","AGO2024",6,"CLAUDIA GAMBOA RODRIGUEZ","SEP2020",6,"CRIMILDA EDUWIGES TREJO GARCIA","FEB2020",6,"DANIELA LOPEZ PLASCENCIA","FEB2019",6,"CARMEN DEL JESUS MENDOZA ACOSTA","AGO2021",6,"BIBIANA RODRIGUEZ PATIÑO","AGO2019",6,"ANTONIO DEL CARMEN GARCIA GUTIERREZ","AGO2008",6,"DANIELA PATRICIA BOJORQUEZ BELTRAN","AGO2024",6,"ELIZABETH DEL JESUS GUTIERREZ NARVAEZ","AGO2016",6,"GABRIELA ZACNITET SANCHEZ JIMENEZ","FEB2025",5,"MAYO",2029,"07:50:00"]
["JOSE_VASCONCELOS","AGO2026",null,null,"VICTOR MANUEL DIONICIO MAY",7,"PENSAMIENTO MATEMATICO I (PROBABILIDAD Y ESTADISTICA)","102PMA1I",4,7,"CLAUDIA AZUSENA PEREZ PAREDES","FEB2025",7,"CRISTINA ESPERANZA MORA LARA","FEB2024",7,"ELYS GUADALUPE CONTRERAS ZETINA","AGO2025",7,"EVELIN TORRES CASTRO","AGO2008",7,"CESAR ALONSO MONTES DE OCA VALDIZON","FEB2023",7,"CARLOS ANTONIO SANCHEZ NAAL","AGO2014",7,"FABIOLA DEL JESUS CRUZ GUTIERREZ","AGO2008",7,"DARWIN AARON BOLON DE LA CRUZ","FEB2025",7,"FERNANDO MANUEL QUINO ALVAREZ","AGO2023",7,"IGNACIO LOPEZ REJON","AGO2023",6,"JUNIO",2030,"08:00:00"]
["JOSE_VASCONCELOS_TURNO_MATUTINO","1 PREINTER ENE27",null,null,"YRMA GARCIA RODRIGUEZ",8,"LABORATORIO DE INVESTIGACION","102LAI1I",3,8,"DAVID MANDUJANO GARCIA","SEP2020",8,"DANIEL ARTURO CASANOVA GOMEZ","AGO2021",8,"EUGENIO DAVID ABREU CASTELLANO","FEB2021",8,"FRANCISCO RUIZ ESQUIVEL","AGO2019",8,"DULCE YESENIA GALINDO REYNOSO","AGO2019",8,"CARLOS JOAQUIN CERVERA SEGOVIA","AGO2015",8,"JOAQUIN JOSE PARRA PEREZ","AGO2008",8,"FERNANDO MANUEL QUINO ALVAREZ","AGO2023",8,"JESUS DANIEL MONTERO LASTRA","AGO2019",8,"IVAN JESUS LOPEZ OREZA","AGO2024",7,"JULIO",2031,"08:10:00"]
["COLEGIO_DEL_GOLFO","2 PREINTER ENE27",null,null,"NARCISO DOMINGUEZ JIMENEZ",9,"RECURSO SOCIOEMOCIONAL (EDUCACION FISICA I)","102REF2I",2,9,"GUADALUPE BERENICE LOPEZ GUTIERREZ","AGO2022",9,"EDGAR PALMER LUNA","AGO2021",9,"FLOR ALONDRA MENDEZ SANCHEZ","AGO2023",9,"GABRIEL DEL CARMEN REYES GONZALEZ","AGO2008",9,"FABIOLA DEL JESUS CRUZ GUTIERREZ","FEB2022",9,"DAVID GERONIMO VALENCIA","FEB2015",9,"JOSE ANTONIO MEZETA GARCIA","AGO2018",9,"JESUS DANIEL MONTERO LASTRA","AGO2023",9,"JORGE RUBEN HUCHIN REJON","AGO2016",9,"JOSE LUIS LOPEZ XOLO","AGO2025",8,"AGOSTO",2032,"08:20:00"]
["COLEGIO_DEL_CARIBE_CARMEN","FEB2027",null,null,"CLAUDIA MARGARITA DEL JESUS SANCHEZ ANDRADE",10,"RECURSO SOCIOEMOCIONAL (ORIENTACION EDUCATIVA I)","102ROE3I",2,10,"HUMBERTO ALEJO FELIX","FEB2021",10,"ERANDI MARIA ISABEL DIAZ PEREZ","FEB2020",10,"JAIRO DEL JESUS PEREZ ARIAS","AGO2022",10,"GUADALUPE ELIZABETH CASANOVA PEREZ","AGO2018",10,"FERNANDO ALEJANDRO TUZ CHIN","FEB2016",10,"DIANA MILDRED HERNANDEZ QUERO","FEB2025",10,"JOSE JESUS ACOSTA VALLADARES","AGO2008",10,"JOSE MARIA ALCOCER JIMENEZ","AGO2025",10,"JOSE JOAQUIN MARTINEZ CEBALLOS","AGO2023",10,"KAREN MICHEL GONZALEZ MORALES","AGO2025",9,"SEPTIEMBRE",2033,"08:30:00"]
[null,"1 PREINTER JUN27",null,null,"MARIO ALBERTO JUAREZ MAGAÑA",null,null,null,null,11,"IRIS YESENIA GARCIA ARA","SEP2020",11,"ESTEFANIA ANTONIO ZARATE","FEB2025",11,"JENNIFER DEL ROSARIO FERRAEZ CAAMAL","FEB2019",11,"HESTIFEN JUAREZ LOPEZ","AGO2018",11,"GABRIELA DEL JESUS FIGUEROA HERNANDEZ","FEB2023",11,"DULCE KARINA OLMOS RAMOS","FEB2023",11,"KENNY XAVIER JIMENEZ CHUMBA","FEB2022",11,"JOSE JOAQUIN MARTINEZ CEBALLOS","AGO2023",11,"MANUEL JOAQUIN GUTIERREZ GOMEZ","AGO2009",11,"NORMA DELIA COBA PEREZ","AGO2024",10,"OCTUBRE",2034,"08:40:00"]
[null,"2 PREINTER JUL27",null,null,"RAYMUNDO LAZARO TORRES HERNANDEZ",null,"II","CLAVE","HORAS POR SEMANA",12,"JESUS ARTURO GONZALEZ BUENFIL","FEB2023",12,"FRANKLIN ENRIQUE PECH SOSA","AGO2022",12,"JENNY JULIETA AGUILAR ENSEÑAT","AGO2024",12,"IVAN JESUS LOPEZ OREZA","AGO2008",12,"GIMEL JESUS GONGORA GOMEZ","FEB2020",12,"ELVIA JOSEFINA CARDENAS CARRILLO","FEB2017",12,"MANUEL ORLANDO CABAÑAS PAT","AGO2011",12,"NEXCI YANETT CRUZ REYES","AGO2023",12,"MARIA EUGENIA FIGUEROA CERVANTES","AGO2008",12,"PIERRE DEL CARMEN AYALA ZAVALA","AGO2024",11,"NOVIEMBRE",2035,"08:50:00"]
[null,"AGO2027",null,null,"MAETZY BEATRIZ FLORES HERNÁNDEZ",1,"CIENCIAS SOCIALES II (INDIVIDUO  Y SOCIEDAD)","102CSO1II",2,13,"JOSE ANTONIO MEZETA GARCIA","SEP2020",13,"GABRIEL MENDOZA ALVARADO","AGO2021",13,"JORGE ALBERTO MAY MARTINEZ","AGO2013",13,"JONATHAN ABRAHAM PIMENTEL","AGO2013",13,"GIOVANNA GUADALUPE DIAZ SANTIAGO","AGO2024",13,"FELIPE GUEMES LANDERO","FEB2015",13,"MARTHA VANESSA DAMAS HERNANDEZ","AGO2008",13,"OSWALDO ROMAN CERVANTES BURGOS","AGO2023",13,"NEXCI YANETT CRUZ REYES","AGO2023",13,"RICARDO OCAÑA DAMIAN","AGO2024",12,"DICIEMBRE",null,"09:00:00"]
[null,"1 PREINTER ENE28",null,null,"ESMERALDA DEL CARMEN LLERGOS MOGUEL",2,"CONSERVACION DE LA ENERGIA Y SUS INTERACCIONES CON LA MATERIA (FISICA I)","102FIS3I",4,14,"JUAN CARLOS HERRERA SANCHEZ","SEP2020",14,"HUGO ALBERTO MARQUEZ MERINO","AGO2022",14,"JOSE ALFREDO RANGEL DEANTES","FEB2023",14,"JOSE LUIS RAMOS CAMARA","AGO2021",14,"HUGO ORLANDO EK VALLE","FEB2023",14,"FERMIN ALEJANDRO BARRADAS HERNANDEZ","FEB2019",14,"MICHAL ZAMBRANO IBAÑEZ","FEB2018",14,"PAOLA SARAY LARRAGA MASSA","AGO2024",14,"OSWALDO ROMAN CERVANTES BURGOS","AGO2023",14,"RODULFO PEREZ LOPEZ","AGO2023",13,null,null,"09:10:00"]
[null,"2 PREINTER ENE28",null,null,"VIRGINIA ASUNCIÓN JIMÉNEZ ABREU",3,"CULTURA DIGITAL II (INFORMATICA  II)","102CDI1II",2,15,"JULIAN HEBERTO HERNANDEZ CORDOVA","AGO2021",15,"IAN ADRIEL ROSAS MALDONADO","AGO2019",15,"JOSE EDUARDO DEHESA MENDOZA","AGO2024",15,"JOSE MARIA ALCOCER JIMENEZ","FEB2023",15,"IRVIN RAFAEL ESTRELLA ROSAS","AGO2024",15,"GLORIA ELENA DE LA HUERTA HERNANDEZ","1 PREINTER ENE25",15,"ROSARIO DEL JESUS COCON TEODORO","AGO2008",null,"SOFIA BEATRIZ BOJORQUEZ BELTRAN","AGO2023",15,"PAOLA SARAY LARRAGA MASSA","AGO2024",15,"SERGIO VELA PAVON","AGO2023",14,null,null,"09:20:00"]
[null,"FEB2028",null,null,"SOFIA BEATRIZ BOJORQUEZ BELTRAN",4,"HUMANIDADES II (CONCIENCIA HUMANA II)","102HUM1II",4,16,"KARINA GUADALUPE FUENTES SOBREVILLA","FEB2025",16,"ISAELY DEL LOURDES CABALLERO MORENO","AGO2019",16,"JOSE LUIS FLORES LUISJUAN","AGO2013",16,"JUAN MANUEL PEREZ GOMEZ","AGO2017",16,"ISABEL CHRISTINE LASTRA GONZALEZ","AGO2019",16,"GLORIA EUGENIA TAPIA DE LA CRUZ","AGO2025",16,"VICTOR VILLAREAL ALEGRIA","AGO2008",null,null,null,16,"SOFIA BEATRIZ BOJORQUEZ BELTRAN","FEB2014",16,"VIVIANA YAEL GOMEZ MARTINEZ","AGO2025",15,null,null,"09:30:00"]
[null,"1 PREINTER JUN28",null,null,"VICTOR MARRUFO MOSCOSO",5,"INGLES II","102ING4II",3,17,"LOURDES MAGALY TZIU GOMEZ","FEB2021",17,"JOSE EMILIO QUEB SUAREZ","FEB2024",17,"JOSEFA LOPEZ MARTINEZ","AGO2013",17,"LIRIO VICTORIA MARTINEZ PEREZ","AGO2018",17,"JORGE MICHAEL VAZQUEZ VERA","AGO2019",17,"HESTIFEN JUAREZ LOPEZ","FEB2017",17,"ZENAIDA AREVALO CORDOVA","FEB2025",null,null,null,null,null,null,null,null,null,16,null,null,"09:40:00"]
[null,"2 PREINTER JUL28",null,null,"RODULFO PEREZ LOPEZ",6,"LA ENERGIA EN LOS PROCESOS BIOLOGICOS (BIOLOGIA I)","102BIO4I",4,18,"LUIS ALBERTO CAVAZOS SALAZAR","AGO2022",18,"JOSE LUIS HERNANDEZ CABRERA","SEP2020",18,"JULIAN HEBERTO HERNANDEZ CORDOVA","AGO2018",18,"MARIA FERNANDA ROSAS GARCIA","AGO2025",18,"JOSELINNE CHAN GURRÍA","FEB2025",18,"ITZEL LORIA SALINAS","AGO2014",null,null,null,null,null,null,null,null,null,null,null,null,17,null,null,"09:50:00"]
[null,null,null,null,null,7,"LENGUA Y COMUNICACION II (LITERATURA  I)","102LYC2II",3,19,"LUIS DANIEL NAAL HERNANDEZ","AGO2024",19,"JUANA ISABEL HUCHIN VAZQUEZ","FEB2025",19,"KARINA ELIZABETH HERNANDEZ RUIZ","FEB2020",19,"MIGUEL ANGEL CRUZ GUTIERREZ","FEB2017",19,"JULIAN HEBERTO HERNANDEZ CORDOVA","FEB2017",19,"JOSCELYN MACIAS REYES","FEB2016",null,null,null,null,null,null,null,null,null,null,null,null,18,null,null,"10:00:00"]
[null,null,null,null,null,8,"PENSAMIENTO MATEMATICO  II (ALGEBRA)","102PMA1II",4,20,"MARIA DEL ROSARIO ARIAS HERNANDEZ","AGO2021",20,"JUAN CARLOS HERRERA GARCIA","SEP2020",20,"KARINA GONZALEZ VARGAS","AGO2022",20,"RAYMUNDO LAZARO TORRES HERNANDEZ","FEB2018",20,"KARLA DENNIS CORDERO GALERO","FEB2023",20,"JUAN ALEJANDRO ESCANDON GUZMAN","FEB2022",null,null,null,null,null,null,null,null,null,null,null,null,19,null,null,"10:10:00"]
[null,null,null,null,null,9,"RECURSO SOCIOEMOCIONAL (EDUCACION FISICA II)","102REF3II",2,21,"MARTIN HEREDIA ALVARADO","AGO2024",21,"JUAN JOSE BASULTO PEREZ","SEP2020",21,"LAURA ELIZABETH ORTIZ GALLARDO","AGO2024",null,null,null,21,"MAETZY BEATRIZ FLORES HERNANDEZ","FEB2017",21,"JUAN LUIS PACHECO MARTIN","AGO2014",null,null,null,null,null,null,null,null,null,null,null,null,20,null,null,"10:20:00"]
[null,null,null,null,null,10,"RECURSO SOCIOEMOCIONAL (ORIENTACION EDUCATIVA II)","102ROE2II",2,22,"PIERRE DEL CARMEN AYALA ZAVALA","AGO2023",22,"KARINA GUADALUPE FUENTES SOBREVILLA","FEB2020",22,"LAURITA HERNANDEZ GORDOM","AGO2024",null,null,null,22,"MARIA DEL ROSARIO ARIAS HERNANDEZ","AGO2017",22,"JULISSA ROSSANA ALEJO GONZALEZ","AGO2021",null,null,null,null,null,null,null,null,null,null,null,null,21,null,null,"10:30:00"]
[null,null,null,null,null,null,null,null,null,23,"RICARDO OCAÑA DAMIAN","FEB2025",23,"LEONARDO ENRIQUE VERA LOPEZ","AGO2019",23,"LUIS ENRIQUE ESCALANTE MONTEJO","FEB2023",null,null,null,23,"MARIA DEL SOCORRO CRUZ LOPEZ","FEB2021",23,"LANDY GUADALUPE AGUILAR BENCOMO","AGO2014",null,null,null,null,null,null,null,null,null,null,null,null,22,null,null,"10:40:00"]
[null,null,null,null,null,null,"III","CLAVE","HORAS POR SEMANA",24,"TITO DE LOS SANTOS HERNANDEZ LOPEZ","SEP2020",24,"LUCIA GUADALUPE RUIZ SANCHEZ","AGO2019",24,"MARCOS ANTONIO SOLIS JIMENEZ","FEB2012",null,null,null,24,"MARIA TERESA CAMINO RODRIGUEZ","FEB2025",24,"LILIANA CALDERON SOSA","AGO2014",null,null,null,null,null,null,null,null,null,null,null,null,23,null,null,"10:50:00"]
[null,null,null,null,null,1,"CULTURA DIGITAL III (INFORMATICA  III)","102CDI1III",2,25,"VICTOR HUGO SANCHEZ RODRIGUEZ","AGO2022",25,"LUIS ROBERTO BALAM FLORES","AGO2019",25,"MARIO ALBERTO JUAREZ MAGAÑA","AGO2010",null,null,null,25,"MARISOL DEL RIO DE LA CRUZ","AGO2018",25,"LUIS FERNANDO YOCUPICIO CAMARA","AGO2023",null,null,null,null,null,null,null,null,null,null,null,null,24,null,null,"11:00:00"]
[null,null,null,null,null,2,"ECOSISTEMAS: INTERACCIONES, ENERGIA Y DINAMICA (BIOLOGIA II)","102BIO5II",4,26,"WILLIAM ALFONSO CAHUICH RAMOS","AGO2023",26,"MARIA SOLEDAD LOPEZ PEREZ","SEP2020",26,"MARTHA MORENO BONILLA","FEB2021",null,null,null,26,"MARLENE DEL SAGRARIO MALDONADO SANTANA","AGO2016",26,"LUIS MIGUEL PEREZ RECINOS","AGO2014",null,null,null,null,null,null,null,null,null,null,null,null,25,null,null,"11:10:00"]
[null,null,null,null,null,3,"HUMANIDADES III (CONCIENCIA HUMANA  III)","102HUM1III",5,null,null,null,27,"MARISOL BAUTISTA MENECES","AGO2021",27,"MERARI CRISTEL POZO OSORIO","FEB2022",null,null,null,27,"MARTIN HEREDIA ALVARADO","FEB2014",27,"MANUEL IVAN CASTRO DOMINGUEZ","AGO2014",null,null,null,null,null,null,null,null,null,null,null,null,26,null,null,"11:20:00"]
[null,null,null,null,null,4,"INGLES III","102ING6III",3,null,null,null,28,"MAYIVE MENDEZ DOMINGUEZ","AGO2019",28,"NANCY EVELIN AQUINO MUÑOZ","FEB2018",null,null,null,28,"OCTAVIO FERNANDO JUAREZ GONZALEZ","AGO2025",28,"MARIA DEL PILAR BENITEZ PINEDA","AGO2025",null,null,null,null,null,null,null,null,null,null,null,null,27,null,null,"11:30:00"]
[null,null,null,null,null,5,"LENGUA Y COMUNICACION III (LITERATURA  II)","102LYC1III",3,null,null,null,29,"ROBERTO CARLOS CHI YAH","AGO2019",29,"SIMON ANDRES DENIS TOACHE","FEB2022",null,null,null,29,"PERLA ESMERALDA PAGES PACHECO","FEB2020",29,"MARICELA SALLONARA SOLANO MORENO","AGO2024",null,null,null,null,null,null,null,null,null,null,null,null,28,null,null,"11:40:00"]
[null,null,null,null,null,6,"PENSAMIENTO MATEMATICO  III (INTRODUCCION AL CALCULO I)","102PMA1III",4,null,null,null,30,"ROSSANA KARINA CARRILLO SANGUINO","AGO2019",30,"TERESA DE JESUS VALENZUELA CASTILLO","AGO2024",null,null,null,30,"SAMIA PEREZ NOVEROLA","FEB2023",30,"MARTIN MAURICIO GOMEZ JIMENEZ","AGO2023",null,null,null,null,null,null,null,null,null,null,null,null,29,null,null,"11:50:00"]
[null,null,null,null,null,7,"FUNDAMENTOS DE CREACION DE EMPRESAS","102FCE1I",2,null,null,null,31,"TITO DE LOS SANTOS HERNANDEZ LOPEZ","SEP2020",31,"VANESSA IVONNE BORJAS PEREZ","FEB2017",null,null,null,31,"SEBASTIAN DEL CARMEN MARTINEZ DAMIAN","AGO2024",31,"MIGUEL ANTONIO COMOM PUCH","FEB2015",null,null,null,null,null,null,null,null,null,null,null,null,30,null,null,"12:00:00"]
[null,null,null,null,null,8,"INTRODUCCION A LA ANATOMIA HUMANA","102IAH2I",2,null,null,null,32,"VERONICA CONCEPCION CRUZ AYALA","AGO2021",32,"VANIA IRASEMA JIMENEZ ZAVALA","AGO2024",null,null,null,32,"YESENIA AMISADAI HERNANDEZ PECH","FEB2023",32,"NAOMI GALINDO MARES","FEB2023",null,null,null,null,null,null,null,null,null,null,null,null,31,null,null,"12:10:00"]
[null,null,null,null,null,9,"RECURSO SOCIOEMOCIONAL (EDUCACION FISICA III)","102REF1III",2,null,null,null,33,"VICTOR MORA CABALLERO","FEB2025",33,"YONI GABRIEL GOMEZ BLANCO","FEB2018",null,null,null,null,null,null,33,"PATRICIA ANDRADE SAN MARTIN","AGO2015",null,null,null,null,null,null,null,null,null,null,null,null,null,null,null,"12:20:00"]
[null,null,null,null,null,10,"RECURSO SOCIOEMOCIONAL (TALLER ARTISTICO I) DIBUJO Y PINTURA I","102RAP6I",2,null,null,null,34,"YESENIA JOHANA CAN AYIL","FEB2023",null,"YURIDIANA CRUZ MONTES DE OCA","AGO2014",null,null,null,null,null,null,34,"ROSANGELICA ASUNCION VAZQUEZ MORENO","FEB2019",null,null,null,null,null,null,null,null,null,null,null,null,null,null,null,"12:30:00"]
[null,null,null,null,null,11,"RECURSO SOCIOEMOCIONAL (TALLER ARTISTICO I) CANTO  I","102RAC3I",2,null,null,null,35,"YOANIBETH JIMENEZ ALEJO","SEP2020",null,null,null,null,null,null,null,null,null,35,"ROXANA DEL ROSARIO VIANA SALAZAR","AGO2015",null,null,null,null,null,null,null,null,null,null,null,null,null,null,null,"12:40:00"]
[null,null,null,null,null,12,"RECURSO SOCIOEMOCIONAL (TALLER ARTISTICO I) DANZA FOLCLORICA MEXICANA I","102RAD2I",2,null,null,null,null,null,null,null,null,null,null,null,null,null,null,null,36,"SANDRA EUGENIA VIVEROS SANCHEZ","AGO2025",null,null,null,null,null,null,null,null,null,null,null,null,null,null,null,"12:50:00"]
[null,null,null,null,null,13,"RECURSO SOCIOEMOCIONAL (TALLER ARTISTICO I) FOTOGRAFIA I","102RAF2I",2,null,null,null,null,null,null,null,null,null,null,null,null,null,null,null,37,"VARINIA YAZMIN VALDIVIEZO IBARRA","AGO2017",null,null,null,null,null,null,null,null,null,null,null,null,null,null,null,"13:00:00"]
[null,null,null,null,null,14,"RECURSO SOCIOEMOCIONAL (TALLER ARTISTICO I) GUITARRA I","102RAG2I",2,null,null,null,null,null,null,null,null,null,null,null,null,null,null,null,null,null,null,null,null,null,null,null,null,null,null,null,null,null,null,null,null,null,"13:10:00"]
[null,null,null,null,null,15,"RECURSO SOCIOEMOCIONAL (TALLER ARTISTICO I) GUITARRA POPULAR CARIBEÑA I","102RGP2I",2,null,null,null,null,null,null,null,null,null,null,null,null,null,null,null,null,null,null,null,null,null,null,null,null,null,null,null,null,null,null,null,null,null,"13:20:00"]
{"$rows_left_out":134}
{"sheet":"1A","index":1,"n_rows":24,"n_cols":23,"rows_kept":24,"cut":false,"hidden":false,"merged":[[7,4,8,4],[18,1,18,3],[18,5,18,7],[22,11,22,20],[23,11,23,20],[15,1,15,3],[15,5,15,7],[16,1,16,3],[16,5,16,7],[17,1,17,3],[17,5,17,7],[12,1,12,3],[12,5,12,7],[13,1,13,3],[13,5,13,7],[14,1,14,3],[14,5,14,7],[9,1,9,3],[9,5,9,7],[10,1,10,3],[10,5,10,7],[11,1,11,3],[11,5,11,7],[8,9,8,11],[8,12,8,14],[8,15,8,17],[8,18,8,20],[8,21,8,23],[2,0,2,3],[2,4,2,13],[0,18,0,20],[0,21,0,23],[7,0,8,0],[7,1,8,3],[7,5,8,7],[0,14,0,15],[0,16,0,17],[3,0,3,1],[3,2,3,3],[4,0,4,1],[5,0,5,1],[5,2,5,5],[7,8,8,8],[7,9,7,23]]}
[null,null,null,null,null,null,null,null,null,null,null,null,null,null,"FECHA:",null,"DIA",null,"MES",null,null,"AÑO"]
[]
["ESCUELA PREPARATORIA INCORPORADA:"]
["PERIODO:"]
["SEMESTRE:"]
["GRUPO:"]
[]
["N°","NOMBRE DEL PROFESOR",null,null,"CLAVE","CURSO",null,null,"HORAS POR SEMANA","HORARIO"]
[null,null,null,null,null,null,null,null,null,"LUNES",null,null,"MARTES",null,null,"MIÉRCOLES",null,null,"JUEVES",null,null,"VIERNES"]
[1,null,null,null,{"$f":"_xlfn.IFNA(VLOOKUP(F10,DATOS!G:I,2,FALSE),\" \")","v":" "},null,null,null,{"$f":"_xlfn.IFNA(VLOOKUP(F10,DATOS!G:I,3,FALSE),\" \")","v":" "},null,"-",null,null,"-",null,null,"-",null,null,"-",null,null,"-"]
[2,null,null,null,{"$f":"_xlfn.IFNA(VLOOKUP(F11,DATOS!G:I,2,FALSE),\" \")","v":" "},null,null,null,{"$f":"_xlfn.IFNA(VLOOKUP(F11,DATOS!G:I,3,FALSE),\" \")","v":" "},null,"-",null,null,"-",null,null,"-",null,null,"-",null,null,"-"]
[3,null,null,null,{"$f":"_xlfn.IFNA(VLOOKUP(F12,DATOS!G:I,2,FALSE),\" \")","v":" "},null,null,null,{"$f":"_xlfn.IFNA(VLOOKUP(F12,DATOS!G:I,3,FALSE),\" \")","v":" "},null,"-",null,null,"-",null,null,"-",null,null,"-",null,null,"-"]
[4,null,null,null,{"$f":"_xlfn.IFNA(VLOOKUP(F13,DATOS!G:I,2,FALSE),\" \")","v":" "},null,null,null,{"$f":"_xlfn.IFNA(VLOOKUP(F13,DATOS!G:I,3,FALSE),\" \")","v":" "},null,"-",null,null,"-",null,null,"-",null,null,"-",null,null,"-"]
[5,null,null,null,{"$f":"_xlfn.IFNA(VLOOKUP(F14,DATOS!G:I,2,FALSE),\" \")","v":" "},null,null,null,{"$f":"_xlfn.IFNA(VLOOKUP(F14,DATOS!G:I,3,FALSE),\" \")","v":" "},null,"-",null,null,"-",null,null,"-",null,null,"-",null,null,"-"]
[6,null,null,null,{"$f":"_xlfn.IFNA(VLOOKUP(F15,DATOS!G:I,2,FALSE),\" \")","v":" "},null,null,null,{"$f":"_xlfn.IFNA(VLOOKUP(F15,DATOS!G:I,3,FALSE),\" \")","v":" "},null,"-",null,null,"-",null,null,"-",null,null,"-",null,null,"-"]
[7,null,null,null,{"$f":"_xlfn.IFNA(VLOOKUP(F16,DATOS!G:I,2,FALSE),\" \")","v":" "},null,null,null,{"$f":"_xlfn.IFNA(VLOOKUP(F16,DATOS!G:I,3,FALSE),\" \")","v":" "},null,"-",null,null,"-",null,null,"-",null,null,"-",null,null,"-"]
[8,null,null,null,{"$f":"_xlfn.IFNA(VLOOKUP(F17,DATOS!G:I,2,FALSE),\" \")","v":" "},null,null,null,{"$f":"_xlfn.IFNA(VLOOKUP(F17,DATOS!G:I,3,FALSE),\" \")","v":" "},null,"-",null,null,"-",null,null,"-",null,null,"-",null,null,"-"]
[9,null,null,null,{"$f":"_xlfn.IFNA(VLOOKUP(F18,DATOS!G:I,2,FALSE),\" \")","v":" "},null,null,null,{"$f":"_xlfn.IFNA(VLOOKUP(F18,DATOS!G:I,3,FALSE),\" \")","v":" "},null,"-",null,null,"-",null,null,"-",null,null,"-",null,null,"-"]
[10,null,null,null,{"$f":"_xlfn.IFNA(VLOOKUP(F19,DATOS!G:I,2,FALSE),\" \")","v":" "},null,null,null,{"$f":"_xlfn.IFNA(VLOOKUP(F19,DATOS!G:I,3,FALSE),\" \")","v":" "},null,"-",null,null,"-",null,null,"-",null,null,"-",null,null,"-"]
[]
[]
[]
[]
[null,null,null,null,null,null,null,null,null,null,null,"NOMBRE DEL DIRECTOR"]